{"text_format":"3","workbook":"xlsx","n_sheets":2,"sheets":["汇总表","辅助表"],"not_rendered":{"defined_names":1},"read":"whole","date_system":"1900"}

{"sheet":"汇总表","index":0,"n_rows":301,"n_cols":6,"rows_kept":301}
["单位","岗位","职位代码","招录人数","报考人数","竞争比"]
[{"$f":"VLOOKUP($C:$C,辅助表!$A:$C,2,0)","v":"各级人民法院"},{"$f":"VLOOKUP($C:$C,辅助表!$A:$C,3,0)","v":"法官助理职位二"},45150002,155,768,{"$f":"E2/D2","v":{"v":4.95483870967742,"d":"5"}}]
[{"$f":"VLOOKUP($C:$C,辅助表!$A:$C,2,0)","v":"桂林市兴安县华江瑶族乡人民政府"},{"$f":"VLOOKUP($C:$C,辅助表!$A:$C,3,0)","v":"综合职位一"},45030270,2,735,{"$f":"E3/D3","v":{"v":367.5,"d":"368"}}]
[{"$f":"VLOOKUP($C:$C,辅助表!$A:$C,2,0)","v":"市、县级公安机关"},{"$f":"VLOOKUP($C:$C,辅助表!$A:$C,3,0)","v":"大数据职位三"},45150017,73,417,{"v":5.71232876712329,"d":"6"}]
[{"$f":"VLOOKUP($C:$C,辅助表!$A:$C,2,0)","v":"钦州市灵山县乡镇机关"},{"$f":"VLOOKUP($C:$C,辅助表!$A:$C,3,0)","v":"综合职位五"},45070086,4,387,{"v":96.75,"d":"97"}]
[{"$f":"VLOOKUP($C:$C,辅助表!$A:$C,2,0)","v":"各级人民法院"},{"$f":"VLOOKUP($C:$C,辅助表!$A:$C,3,0)","v":"法官助理职位一"},45150001,155,386,{"v":2.49032258064516,"d":"2"}]
[{"$f":"VLOOKUP($C:$C,辅助表!$A:$C,2,0)","v":"南宁市青秀区综合行政执法队"},{"$f":"VLOOKUP($C:$C,辅助表!$A:$C,3,0)","v":"综合职位二（一级科员）"},45010131,6,372,62]
[{"$f":"VLOOKUP($C:$C,辅助表!$A:$C,2,0)","v":"南宁市横州市文学艺术界联合会"},{"$f":"VLOOKUP($C:$C,辅助表!$A:$C,3,0)","v":"综合职位（一级科员）"},45010425,1,347,347]
[{"$f":"VLOOKUP($C:$C,辅助表!$A:$C,2,0)","v":"各级人民检察院"},{"$f":"VLOOKUP($C:$C,辅助表!$A:$C,3,0)","v":"检察官助理职位二"},45150011,54,336,{"v":6.22222222222222,"d":"6"}]
[{"$f":"VLOOKUP($C:$C,辅助表!$A:$C,2,0)","v":"玉林市容县乡镇人民政府"},{"$f":"VLOOKUP($C:$C,辅助表!$A:$C,3,0)","v":"综合职位三"},45250153,5,331,{"v":66.2,"d":"66"}]
[{"$f":"VLOOKUP($C:$C,辅助表!$A:$C,2,0)","v":"南宁市青秀区经济贸易和信息化局"},{"$f":"VLOOKUP($C:$C,辅助表!$A:$C,3,0)","v":"综合职位（一级科员）"},45010127,1,328,328]
[{"$f":"VLOOKUP($C:$C,辅助表!$A:$C,2,0)","v":"南宁市江南区统计局"},{"$f":"VLOOKUP($C:$C,辅助表!$A:$C,3,0)","v":"综合职位（一级科员）"},45010162,1,301,301]
[{"$f":"VLOOKUP($C:$C,辅助表!$A:$C,2,0)","v":"南宁市武鸣区灵马镇人民政府"},{"$f":"VLOOKUP($C:$C,辅助表!$A:$C,3,0)","v":"综合职位二"},45010286,1,285,285]
[{"$f":"VLOOKUP($C:$C,辅助表!$A:$C,2,0)","v":"南宁市公安局"},{"$f":"VLOOKUP($C:$C,辅助表!$A:$C,3,0)","v":"警务信息侦控职位一"},45010055,5,283,{"v":56.6,"d":"57"}]
[{"$f":"VLOOKUP($C:$C,辅助表!$A:$C,2,0)","v":"贵港市平南县县直机关"},{"$f":"VLOOKUP($C:$C,辅助表!$A:$C,3,0)","v":"综合管理职位二"},45080064,4,283,{"v":70.75,"d":"71"}]
[{"$f":"VLOOKUP($C:$C,辅助表!$A:$C,2,0)","v":"河池市宜州区乡镇人民政府"},{"$f":"VLOOKUP($C:$C,辅助表!$A:$C,3,0)","v":"综合职位一"},45270066,2,283,{"v":141.5,"d":"142"}]
[{"$f":"VLOOKUP($C:$C,辅助表!$A:$C,2,0)","v":"百色市田阳区乡镇人民政府"},{"$f":"VLOOKUP($C:$C,辅助表!$A:$C,3,0)","v":"乡村振兴助理职位一"},45260090,4,280,70]
[{"$f":"VLOOKUP($C:$C,辅助表!$A:$C,2,0)","v":"钦州市灵山县乡镇机关"},{"$f":"VLOOKUP($C:$C,辅助表!$A:$C,3,0)","v":"综合职位四"},45070085,7,273,39]
[{"$f":"VLOOKUP($C:$C,辅助表!$A:$C,2,0)","v":"南宁市青秀区行政机关二"},{"$f":"VLOOKUP($C:$C,辅助表!$A:$C,3,0)","v":"综合职位（一级科员）"},45010126,2,271,{"v":135.5,"d":"136"}]
[{"$f":"VLOOKUP($C:$C,辅助表!$A:$C,2,0)","v":"南宁市兴宁区综合行政执法队"},{"$f":"VLOOKUP($C:$C,辅助表!$A:$C,3,0)","v":"综合职位十二"},45010116,1,267,267]
[{"$f":"VLOOKUP($C:$C,辅助表!$A:$C,2,0)","v":"南宁市西乡塘区政务服务局"},{"$f":"VLOOKUP($C:$C,辅助表!$A:$C,3,0)","v":"综合职位二（一级科员）"},45010197,1,265,265]
[{"$f":"VLOOKUP($C:$C,辅助表!$A:$C,2,0)","v":"梧州市苍梧县梨埠镇人民政府"},{"$f":"VLOOKUP($C:$C,辅助表!$A:$C,3,0)","v":"武装干事职位"},45040080,1,257,257]
[{"$f":"VLOOKUP($C:$C,辅助表!$A:$C,2,0)","v":"南宁市投资促进局"},{"$f":"VLOOKUP($C:$C,辅助表!$A:$C,3,0)","v":"综合职位二"},45010039,1,255,255]
[{"$f":"VLOOKUP($C:$C,辅助表!$A:$C,2,0)","v":"百色市德保县乡镇人民政府"},{"$f":"VLOOKUP($C:$C,辅助表!$A:$C,3,0)","v":"综合职位四"},45260160,5,253,{"v":50.6,"d":"51"}]
[{"$f":"VLOOKUP($C:$C,辅助表!$A:$C,2,0)","v":"南宁市西乡塘区人力资源和社会保障局"},{"$f":"VLOOKUP($C:$C,辅助表!$A:$C,3,0)","v":"办公室综合职位（一级科员）"},45010190,1,252,252]
[{"$f":"VLOOKUP($C:$C,辅助表!$A:$C,2,0)","v":"百色市那坡县百南乡人民政府"},{"$f":"VLOOKUP($C:$C,辅助表!$A:$C,3,0)","v":"武装干事职位"},45260198,1,250,250]
[{"$f":"VLOOKUP($C:$C,辅助表!$A:$C,2,0)","v":"河池市宜州区德胜镇人民政府"},{"$f":"VLOOKUP($C:$C,辅助表!$A:$C,3,0)","v":"综合职位"},45270063,2,250,125]
[{"$f":"VLOOKUP($C:$C,辅助表!$A:$C,2,0)","v":"南宁市青秀区行政机关一"},{"$f":"VLOOKUP($C:$C,辅助表!$A:$C,3,0)","v":"综合职位（一级科员）"},45010125,2,247,{"v":123.5,"d":"124"}]
[{"$f":"VLOOKUP($C:$C,辅助表!$A:$C,2,0)","v":"钦州市灵山县乡镇机关"},{"$f":"VLOOKUP($C:$C,辅助表!$A:$C,3,0)","v":"综合职位六"},45070087,6,244,{"v":40.6666666666667,"d":"41"}]
[{"$f":"VLOOKUP($C:$C,辅助表!$A:$C,2,0)","v":"柳州市三江侗族自治县财政局"},{"$f":"VLOOKUP($C:$C,辅助表!$A:$C,3,0)","v":"综合职位"},45020327,2,239,{"v":119.5,"d":"120"}]
[{"$f":"VLOOKUP($C:$C,辅助表!$A:$C,2,0)","v":"南宁市马山县乡镇人民政府"},{"$f":"VLOOKUP($C:$C,辅助表!$A:$C,3,0)","v":"综合职位四（一级科员）"},45010348,3,237,79]
[{"$f":"VLOOKUP($C:$C,辅助表!$A:$C,2,0)","v":"市、县级公安机关"},{"$f":"VLOOKUP($C:$C,辅助表!$A:$C,3,0)","v":"网络安全职位二"},45150031,49,234,{"v":4.77551020408163,"d":"5"}]
[{"$f":"VLOOKUP($C:$C,辅助表!$A:$C,2,0)","v":"贵港市桂平市市直机关"},{"$f":"VLOOKUP($C:$C,辅助表!$A:$C,3,0)","v":"综合职位一"},45080095,4,232,58]
[{"$f":"VLOOKUP($C:$C,辅助表!$A:$C,2,0)","v":"未成年犯管教所（邕州监狱）"},{"$f":"VLOOKUP($C:$C,辅助表!$A:$C,3,0)","v":"护理职位二"},45150368,1,230,230]
[{"$f":"VLOOKUP($C:$C,辅助表!$A:$C,2,0)","v":"贺州市富川瑶族自治县福利镇人民政府"},{"$f":"VLOOKUP($C:$C,辅助表!$A:$C,3,0)","v":"人民武装干事职位"},45240168,1,227,227]
[{"$f":"VLOOKUP($C:$C,辅助表!$A:$C,2,0)","v":"柳州市城中区文化体育广电和旅游局"},{"$f":"VLOOKUP($C:$C,辅助表!$A:$C,3,0)","v":"综合职位一"},45020078,1,223,223]
[{"$f":"VLOOKUP($C:$C,辅助表!$A:$C,2,0)","v":"南宁市邕宁区综合行政执法队"},{"$f":"VLOOKUP($C:$C,辅助表!$A:$C,3,0)","v":"综合职位六（一级科员）"},45010247,1,219,219]
[{"$f":"VLOOKUP($C:$C,辅助表!$A:$C,2,0)","v":"柳州市柳南区文化体育广电和旅游局"},{"$f":"VLOOKUP($C:$C,辅助表!$A:$C,3,0)","v":"综合职位"},45020109,1,215,215]
[{"$f":"VLOOKUP($C:$C,辅助表!$A:$C,2,0)","v":"崇左市龙州县各乡镇人民政府"},{"$f":"VLOOKUP($C:$C,辅助表!$A:$C,3,0)","v":"综合职位七"},45210166,3,213,71]
[{"$f":"VLOOKUP($C:$C,辅助表!$A:$C,2,0)","v":"百色市田东县文化体育广电和旅游局"},{"$f":"VLOOKUP($C:$C,辅助表!$A:$C,3,0)","v":"综合职位"},45260110,1,210,210]
[{"$f":"VLOOKUP($C:$C,辅助表!$A:$C,2,0)","v":"玉林市玉州区市场监督管理局"},{"$f":"VLOOKUP($C:$C,辅助表!$A:$C,3,0)","v":"综合职位一"},45250048,3,207,69]
[{"$f":"VLOOKUP($C:$C,辅助表!$A:$C,2,0)","v":"柳州市文化市场综合行政执法支队"},{"$f":"VLOOKUP($C:$C,辅助表!$A:$C,3,0)","v":"综合职位一"},45020063,2,206,103]
[{"$f":"VLOOKUP($C:$C,辅助表!$A:$C,2,0)","v":"柳州市城中区住房和城乡建设局"},{"$f":"VLOOKUP($C:$C,辅助表!$A:$C,3,0)","v":"综合职位一"},45020075,1,206,206]
[{"$f":"VLOOKUP($C:$C,辅助表!$A:$C,2,0)","v":"南宁市投资促进局"},{"$f":"VLOOKUP($C:$C,辅助表!$A:$C,3,0)","v":"综合职位三"},45010040,1,201,201]
[{"$f":"VLOOKUP($C:$C,辅助表!$A:$C,2,0)","v":"梧州市岑溪市乡镇机关"},{"$f":"VLOOKUP($C:$C,辅助表!$A:$C,3,0)","v":"综合职位五"},45040141,5,200,40]
[{"$f":"VLOOKUP($C:$C,辅助表!$A:$C,2,0)","v":"梧州市岑溪市乡镇机关"},{"$f":"VLOOKUP($C:$C,辅助表!$A:$C,3,0)","v":"综合职位六"},45040142,5,200,40]
[{"$f":"VLOOKUP($C:$C,辅助表!$A:$C,2,0)","v":"玉林市玉州区城市管理综合行政执法大队"},{"$f":"VLOOKUP($C:$C,辅助表!$A:$C,3,0)","v":"行政执法职位一"},45250052,5,199,{"v":39.8,"d":"40"}]
[{"$f":"VLOOKUP($C:$C,辅助表!$A:$C,2,0)","v":"玉林市博白县大坝镇人民政府"},{"$f":"VLOOKUP($C:$C,辅助表!$A:$C,3,0)","v":"综合职位"},45250233,1,198,198]
[{"$f":"VLOOKUP($C:$C,辅助表!$A:$C,2,0)","v":"柳州市城中区市场监督管理局"},{"$f":"VLOOKUP($C:$C,辅助表!$A:$C,3,0)","v":"综合职位一"},45020080,2,197,{"v":98.5,"d":"99"}]
[{"$f":"VLOOKUP($C:$C,辅助表!$A:$C,2,0)","v":"贵港市平南县国安瑶族乡人民政府"},{"$f":"VLOOKUP($C:$C,辅助表!$A:$C,3,0)","v":"办公室综合职位"},45080091,1,195,195]
[{"$f":"VLOOKUP($C:$C,辅助表!$A:$C,2,0)","v":"贵港市平南县乡镇机关"},{"$f":"VLOOKUP($C:$C,辅助表!$A:$C,3,0)","v":"综合职位一"},45080059,4,193,{"v":48.25,"d":"48"}]
[{"$f":"VLOOKUP($C:$C,辅助表!$A:$C,2,0)","v":"南宁市武鸣区乡镇人民政府"},{"$f":"VLOOKUP($C:$C,辅助表!$A:$C,3,0)","v":"综合职位一"},45010288,4,191,{"v":47.75,"d":"48"}]
[{"$f":"VLOOKUP($C:$C,辅助表!$A:$C,2,0)","v":"柳州市柳南区区直机关"},{"$f":"VLOOKUP($C:$C,辅助表!$A:$C,3,0)","v":"综合职位二"},45020104,2,191,{"v":95.5,"d":"96"}]
[{"$f":"VLOOKUP($C:$C,辅助表!$A:$C,2,0)","v":"河池市环江毛南族自治县部分县直单位"},{"$f":"VLOOKUP($C:$C,辅助表!$A:$C,3,0)","v":"综合职位"},45270138,5,191,{"v":38.2,"d":"38"}]
[{"$f":"VLOOKUP($C:$C,辅助表!$A:$C,2,0)","v":"来宾市忻城县古蓬镇人民政府"},{"$f":"VLOOKUP($C:$C,辅助表!$A:$C,3,0)","v":"综合职位"},45220085,1,186,186]
[{"$f":"VLOOKUP($C:$C,辅助表!$A:$C,2,0)","v":"南宁市邕宁区市场监督管理局"},{"$f":"VLOOKUP($C:$C,辅助表!$A:$C,3,0)","v":"综合职位二（一级科员）"},45010240,1,185,185]
[{"$f":"VLOOKUP($C:$C,辅助表!$A:$C,2,0)","v":"钦州市灵山县县镇机关"},{"$f":"VLOOKUP($C:$C,辅助表!$A:$C,3,0)","v":"综合职位二"},45070077,4,185,{"v":46.25,"d":"46"}]
[{"$f":"VLOOKUP($C:$C,辅助表!$A:$C,2,0)","v":"来宾市忻城县县乡机关"},{"$f":"VLOOKUP($C:$C,辅助表!$A:$C,3,0)","v":"综合职位一"},45220073,3,184,{"v":61.3333333333333,"d":"61"}]
[{"$f":"VLOOKUP($C:$C,辅助表!$A:$C,2,0)","v":"百色市德保县乡镇人民政府"},{"$f":"VLOOKUP($C:$C,辅助表!$A:$C,3,0)","v":"综合职位五"},45260161,3,184,{"v":61.3333333333333,"d":"61"}]
[{"$f":"VLOOKUP($C:$C,辅助表!$A:$C,2,0)","v":"南宁市武鸣区灵马镇人民政府"},{"$f":"VLOOKUP($C:$C,辅助表!$A:$C,3,0)","v":"综合职位一"},45010285,1,183,183]
[{"$f":"VLOOKUP($C:$C,辅助表!$A:$C,2,0)","v":"柳州市柳北区文化体育广电和旅游局"},{"$f":"VLOOKUP($C:$C,辅助表!$A:$C,3,0)","v":"综合职位"},45020130,1,182,182]
[{"$f":"VLOOKUP($C:$C,辅助表!$A:$C,2,0)","v":"南宁市市场监督管理局"},{"$f":"VLOOKUP($C:$C,辅助表!$A:$C,3,0)","v":"监督管理职位四"},45010044,1,180,180]
[{"$f":"VLOOKUP($C:$C,辅助表!$A:$C,2,0)","v":"梧州市藤县乡镇机关"},{"$f":"VLOOKUP($C:$C,辅助表!$A:$C,3,0)","v":"办公室综合职位二"},45040183,4,179,{"v":44.75,"d":"45"}]
[{"$f":"VLOOKUP($C:$C,辅助表!$A:$C,2,0)","v":"南宁市武鸣区乡镇人民政府"},{"$f":"VLOOKUP($C:$C,辅助表!$A:$C,3,0)","v":"综合职位三"},45010290,8,176,22]
[{"$f":"VLOOKUP($C:$C,辅助表!$A:$C,2,0)","v":"南宁市横州市陶圩镇人民政府"},{"$f":"VLOOKUP($C:$C,辅助表!$A:$C,3,0)","v":"综合职位（一级科员）"},45010450,1,176,176]
[{"$f":"VLOOKUP($C:$C,辅助表!$A:$C,2,0)","v":"南宁市马山县城市管理综合行政执法大队"},{"$f":"VLOOKUP($C:$C,辅助表!$A:$C,3,0)","v":"综合职位一（一级科员）"},45010341,1,175,175]
[{"$f":"VLOOKUP($C:$C,辅助表!$A:$C,2,0)","v":"县级人民法院"},{"$f":"VLOOKUP($C:$C,辅助表!$A:$C,3,0)","v":"法官助理职位四"},45150004,60,175,{"$f":"E67/D67","v":{"v":2.91666666666667,"d":"3"}}]
[{"$f":"VLOOKUP($C:$C,辅助表!$A:$C,2,0)","v":"桂林市文化市场综合行政执法支队"},{"$f":"VLOOKUP($C:$C,辅助表!$A:$C,3,0)","v":"综合职位三"},45030088,1,172,172]
[{"$f":"VLOOKUP($C:$C,辅助表!$A:$C,2,0)","v":"自治区供销社"},{"$f":"VLOOKUP($C:$C,辅助表!$A:$C,3,0)","v":"项目管理职位"},45150108,1,172,172]
[{"$f":"VLOOKUP($C:$C,辅助表!$A:$C,2,0)","v":"南宁市市场监督管理局"},{"$f":"VLOOKUP($C:$C,辅助表!$A:$C,3,0)","v":"监督管理职位三"},45010043,1,170,170]
[{"$f":"VLOOKUP($C:$C,辅助表!$A:$C,2,0)","v":"桂林市文化广电和旅游局"},{"$f":"VLOOKUP($C:$C,辅助表!$A:$C,3,0)","v":"综合职位"},45030085,1,170,170]
[{"$f":"VLOOKUP($C:$C,辅助表!$A:$C,2,0)","v":"各级人民检察院"},{"$f":"VLOOKUP($C:$C,辅助表!$A:$C,3,0)","v":"检察官助理职位一"},45150010,57,170,{"v":2.98245614035088,"d":"3"}]
[{"$f":"VLOOKUP($C:$C,辅助表!$A:$C,2,0)","v":"中共南宁市西乡塘区委员会机构编制委员会办公室"},{"$f":"VLOOKUP($C:$C,辅助表!$A:$C,3,0)","v":"办公室综合职位（一级科员）"},45010185,1,168,168]
[{"$f":"VLOOKUP($C:$C,辅助表!$A:$C,2,0)","v":"柳州市招生考试院"},{"$f":"VLOOKUP($C:$C,辅助表!$A:$C,3,0)","v":"综合职位"},45020017,1,168,168]
[{"$f":"VLOOKUP($C:$C,辅助表!$A:$C,2,0)","v":"百色市公安局"},{"$f":"VLOOKUP($C:$C,辅助表!$A:$C,3,0)","v":"监所管理职位"},45260010,3,168,56]
[{"$f":"VLOOKUP($C:$C,辅助表!$A:$C,2,0)","v":"南宁市文化市场综合行政执法支队"},{"$f":"VLOOKUP($C:$C,辅助表!$A:$C,3,0)","v":"综合职位七"},45010097,1,167,167]
[{"$f":"VLOOKUP($C:$C,辅助表!$A:$C,2,0)","v":"桂林市兴安县基层乡镇人民政府"},{"$f":"VLOOKUP($C:$C,辅助表!$A:$C,3,0)","v":"综合职位一"},45030273,4,167,{"v":41.75,"d":"42"}]
[{"$f":"VLOOKUP($C:$C,辅助表!$A:$C,2,0)","v":"南宁市基层人民法院"},{"$f":"VLOOKUP($C:$C,辅助表!$A:$C,3,0)","v":"司法行政职位一"},45010008,2,166,83]
[{"$f":"VLOOKUP($C:$C,辅助表!$A:$C,2,0)","v":"自治区社保中心"},{"$f":"VLOOKUP($C:$C,辅助表!$A:$C,3,0)","v":"社会保险经办职位三"},45150101,1,166,166]
[{"$f":"VLOOKUP($C:$C,辅助表!$A:$C,2,0)","v":"玉林市陆川县人民法院"},{"$f":"VLOOKUP($C:$C,辅助表!$A:$C,3,0)","v":"司法行政职位一"},45250006,2,166,83]
[{"$f":"VLOOKUP($C:$C,辅助表!$A:$C,2,0)","v":"玉林市玉州区城市管理综合行政执法大队"},{"$f":"VLOOKUP($C:$C,辅助表!$A:$C,3,0)","v":"行政执法职位四"},45250055,3,165,55]
[{"$f":"VLOOKUP($C:$C,辅助表!$A:$C,2,0)","v":"南宁市生态环境保护综合行政执法支队"},{"$f":"VLOOKUP($C:$C,辅助表!$A:$C,3,0)","v":"生态环境管理执法职位"},45010084,1,163,163]
[{"$f":"VLOOKUP($C:$C,辅助表!$A:$C,2,0)","v":"百色市隆林各族自治县乡镇人民政府"},{"$f":"VLOOKUP($C:$C,辅助表!$A:$C,3,0)","v":"综合职位一（一级科员）"},45260284,4,163,{"v":40.75,"d":"41"}]
[{"$f":"VLOOKUP($C:$C,辅助表!$A:$C,2,0)","v":"南宁市良庆区人民检察院"},{"$f":"VLOOKUP($C:$C,辅助表!$A:$C,3,0)","v":"检察技术职位"},45010021,1,162,162]
[{"$f":"VLOOKUP($C:$C,辅助表!$A:$C,2,0)","v":"钦州市灵山县县直机关"},{"$f":"VLOOKUP($C:$C,辅助表!$A:$C,3,0)","v":"综合职位"},45070075,2,162,81]
[{"$f":"VLOOKUP($C:$C,辅助表!$A:$C,2,0)","v":"崇左市扶绥县各乡镇人民政府"},{"$f":"VLOOKUP($C:$C,辅助表!$A:$C,3,0)","v":"综合职位二"},45210085,2,162,81]
[{"$f":"VLOOKUP($C:$C,辅助表!$A:$C,2,0)","v":"中共南宁市邕宁区委员会党史研究室"},{"$f":"VLOOKUP($C:$C,辅助表!$A:$C,3,0)","v":"综合职位（一级科员）"},45010236,1,161,161]
[{"$f":"VLOOKUP($C:$C,辅助表!$A:$C,2,0)","v":"百色市田阳区乡镇人民政府"},{"$f":"VLOOKUP($C:$C,辅助表!$A:$C,3,0)","v":"综合职位一"},45260092,4,161,{"v":40.25,"d":"40"}]
[{"$f":"VLOOKUP($C:$C,辅助表!$A:$C,2,0)","v":"桂林市临桂区基层乡镇人民政府"},{"$f":"VLOOKUP($C:$C,辅助表!$A:$C,3,0)","v":"综合职位一"},45030124,4,160,40]
[{"$f":"VLOOKUP($C:$C,辅助表!$A:$C,2,0)","v":"玉林市兴业县乡镇人民政府"},{"$f":"VLOOKUP($C:$C,辅助表!$A:$C,3,0)","v":"综合职位四"},45250250,2,160,80]
[{"$f":"VLOOKUP($C:$C,辅助表!$A:$C,2,0)","v":"柳州市基层人民法院"},{"$f":"VLOOKUP($C:$C,辅助表!$A:$C,3,0)","v":"司法行政职位二"},45020012,3,159,53]
[{"$f":"VLOOKUP($C:$C,辅助表!$A:$C,2,0)","v":"桂林市七星区教育局"},{"$f":"VLOOKUP($C:$C,辅助表!$A:$C,3,0)","v":"综合职位"},45030151,1,159,159]
[{"$f":"VLOOKUP($C:$C,辅助表!$A:$C,2,0)","v":"桂林市秀峰区文学艺术界联合会"},{"$f":"VLOOKUP($C:$C,辅助表!$A:$C,3,0)","v":"综合职位"},45030132,1,155,155]
[{"$f":"VLOOKUP($C:$C,辅助表!$A:$C,2,0)","v":"玉林市玉州区城市管理综合行政执法大队"},{"$f":"VLOOKUP($C:$C,辅助表!$A:$C,3,0)","v":"行政执法职位二"},45250053,5,155,31]
[{"$f":"VLOOKUP($C:$C,辅助表!$A:$C,2,0)","v":"百色市隆林各族自治县乡镇人民政府"},{"$f":"VLOOKUP($C:$C,辅助表!$A:$C,3,0)","v":"综合职位三（一级科员）"},45260286,3,155,{"v":51.6666666666667,"d":"52"}]
[{"$f":"VLOOKUP($C:$C,辅助表!$A:$C,2,0)","v":"桂林市永福县基层乡镇人民政府"},{"$f":"VLOOKUP($C:$C,辅助表!$A:$C,3,0)","v":"综合职位四"},45030293,3,153,51]
[{"$f":"VLOOKUP($C:$C,辅助表!$A:$C,2,0)","v":"南宁铁路运输中级法院"},{"$f":"VLOOKUP($C:$C,辅助表!$A:$C,3,0)","v":"财务管理职位"},45150007,1,152,152]
[{"$f":"VLOOKUP($C:$C,辅助表!$A:$C,2,0)","v":"百色市田东县乡镇人民政府"},{"$f":"VLOOKUP($C:$C,辅助表!$A:$C,3,0)","v":"武装干事职位"},45260120,2,152,76]
[{"$f":"VLOOKUP($C:$C,辅助表!$A:$C,2,0)","v":"南宁市西乡塘区市场监督管理局"},{"$f":"VLOOKUP($C:$C,辅助表!$A:$C,3,0)","v":"衡阳市场监督管理所职位（一级科员）"},45010194,1,151,151]
[{"$f":"VLOOKUP($C:$C,辅助表!$A:$C,2,0)","v":"贵港市平南县市场监督管理局基层市场监督管理所"},{"$f":"VLOOKUP($C:$C,辅助表!$A:$C,3,0)","v":"综合管理职位一"},45080075,4,151,{"v":37.75,"d":"38"}]
[{"$f":"VLOOKUP($C:$C,辅助表!$A:$C,2,0)","v":"贵港市桂平市市直机关"},{"$f":"VLOOKUP($C:$C,辅助表!$A:$C,3,0)","v":"综合职位三"},45080097,2,151,{"v":75.5,"d":"76"}]
[{"$f":"VLOOKUP($C:$C,辅助表!$A:$C,2,0)","v":"百色市基层人民检察院"},{"$f":"VLOOKUP($C:$C,辅助表!$A:$C,3,0)","v":"检察技术职位（一级科员）"},45260055,3,151,{"v":50.3333333333333,"d":"50"}]
[{"$f":"VLOOKUP($C:$C,辅助表!$A:$C,2,0)","v":"南宁市隆安县归国华侨联合会"},{"$f":"VLOOKUP($C:$C,辅助表!$A:$C,3,0)","v":"综合职位"},45010300,1,150,150]
[{"$f":"VLOOKUP($C:$C,辅助表!$A:$C,2,0)","v":"桂林市资源县梅溪镇人民政府"},{"$f":"VLOOKUP($C:$C,辅助表!$A:$C,3,0)","v":"综合职位二"},45030413,1,150,150]
[{"$f":"VLOOKUP($C:$C,辅助表!$A:$C,2,0)","v":"梧州市藤县乡镇机关"},{"$f":"VLOOKUP($C:$C,辅助表!$A:$C,3,0)","v":"综合管理职位三"},45040191,4,149,{"v":37.25,"d":"37"}]
[{"$f":"VLOOKUP($C:$C,辅助表!$A:$C,2,0)","v":"南宁市江南区民政局"},{"$f":"VLOOKUP($C:$C,辅助表!$A:$C,3,0)","v":"综合职位（一级科员）"},45010153,1,148,148]
[{"$f":"VLOOKUP($C:$C,辅助表!$A:$C,2,0)","v":"贺州市八步区市场监督管理局"},{"$f":"VLOOKUP($C:$C,辅助表!$A:$C,3,0)","v":"市场监管职位一"},45240036,4,148,37]
[{"$f":"VLOOKUP($C:$C,辅助表!$A:$C,2,0)","v":"贺州市钟山县乡镇基层机关"},{"$f":"VLOOKUP($C:$C,辅助表!$A:$C,3,0)","v":"基层综合职位五"},45240148,3,147,49]
[{"$f":"VLOOKUP($C:$C,辅助表!$A:$C,2,0)","v":"南宁市上林县乡镇人民政府"},{"$f":"VLOOKUP($C:$C,辅助表!$A:$C,3,0)","v":"综合职位三"},45010375,2,146,73]
[{"$f":"VLOOKUP($C:$C,辅助表!$A:$C,2,0)","v":"南宁市基层人民法院"},{"$f":"VLOOKUP($C:$C,辅助表!$A:$C,3,0)","v":"司法行政职位三"},45010010,2,144,72]
[{"$f":"VLOOKUP($C:$C,辅助表!$A:$C,2,0)","v":"北海市合浦县交通运输局"},{"$f":"VLOOKUP($C:$C,辅助表!$A:$C,3,0)","v":"综合职位（一级科员）"},45050118,1,144,144]
[{"$f":"VLOOKUP($C:$C,辅助表!$A:$C,2,0)","v":"玉林市玉州区市场监督管理局"},{"$f":"VLOOKUP($C:$C,辅助表!$A:$C,3,0)","v":"综合职位二"},45250049,3,143,{"v":47.6666666666667,"d":"48"}]
[{"$f":"VLOOKUP($C:$C,辅助表!$A:$C,2,0)","v":"中共南宁市西乡塘区委员会社会工作部"},{"$f":"VLOOKUP($C:$C,辅助表!$A:$C,3,0)","v":"办公室综合职位（一级科员）"},45010184,1,142,142]
[{"$f":"VLOOKUP($C:$C,辅助表!$A:$C,2,0)","v":"桂林市龙胜各族自治县部分县直单位及基层乡镇人民政府"},{"$f":"VLOOKUP($C:$C,辅助表!$A:$C,3,0)","v":"综合职位六"},45030365,4,142,{"v":35.5,"d":"36"}]
[{"$f":"VLOOKUP($C:$C,辅助表!$A:$C,2,0)","v":"梧州市藤县教育局"},{"$f":"VLOOKUP($C:$C,辅助表!$A:$C,3,0)","v":"教育工作职位"},45040147,2,142,71]
[{"$f":"VLOOKUP($C:$C,辅助表!$A:$C,2,0)","v":"贵港市桂平市退役军人事务局"},{"$f":"VLOOKUP($C:$C,辅助表!$A:$C,3,0)","v":"综合职位"},45080120,1,142,142]
[{"$f":"VLOOKUP($C:$C,辅助表!$A:$C,2,0)","v":"百色市田阳区乡镇人民政府"},{"$f":"VLOOKUP($C:$C,辅助表!$A:$C,3,0)","v":"乡村振兴助理职位二"},45260091,4,142,{"v":35.5,"d":"36"}]
[{"$f":"VLOOKUP($C:$C,辅助表!$A:$C,2,0)","v":"来宾市忻城县县乡机关"},{"$f":"VLOOKUP($C:$C,辅助表!$A:$C,3,0)","v":"综合职位二"},45220074,3,141,47]
[{"$f":"VLOOKUP($C:$C,辅助表!$A:$C,2,0)","v":"玉林市福绵区城市管理综合行政执法大队"},{"$f":"VLOOKUP($C:$C,辅助表!$A:$C,3,0)","v":"行政执法职位二"},45250102,2,141,{"v":70.5,"d":"71"}]
[{"$f":"VLOOKUP($C:$C,辅助表!$A:$C,2,0)","v":"南宁市市场监督管理局"},{"$f":"VLOOKUP($C:$C,辅助表!$A:$C,3,0)","v":"万秀市场监督管理所监督管理职位"},45010047,1,140,140]
{"$rows_left_out":182}
{"sheet":"辅助表","index":1,"n_rows":4190,"n_cols":3,"rows_kept":4190}
["职位代码","用人单位","职位名称"]
[45150001,"各级人民法院","法官助理职位一"]
[45150002,"各级人民法院","法官助理职位二"]
[45150003,"县级人民法院","法官助理职位三"]
[45150004,"县级人民法院","法官助理职位四"]
[45150005,"南宁铁路运输中级法院","司法警察职位"]
[45150006,"南宁铁路运输中级法院","行政管理职位"]
[45150007,"南宁铁路运输中级法院","财务管理职位"]
[45150008,"南宁铁路运输法院","司法警察职位"]
[45150009,"北海海事法院","财务管理职位"]
[45150010,"各级人民检察院","检察官助理职位一"]
[45150011,"各级人民检察院","检察官助理职位二"]
[45150012,"县级人民检察院","检察官助理职位三"]
[45150013,"县级人民检察院","检察官助理职位四"]
[45150014,"自治区鹿寨地区人民检察院","司法警察职位"]
[45150015,"市级公安机关","大数据职位一"]
[45150016,"市、县级公安机关","大数据职位二"]
[45150017,"市、县级公安机关","大数据职位三"]
[45150018,"南宁市各县公安局","大数据职位四"]
[45150019,"桂林市各县公安局","大数据职位五"]
[45150020,"防城港市各县公安局","大数据职位六"]
[45150021,"钦州市各县公安局","大数据职位七"]
[45150022,"玉林市各县公安局","大数据职位八"]
[45150023,"百色市各县公安局","大数据职位九"]
[45150024,"贺州市各县公安局","大数据职位十"]
[45150025,"河池市各县公安局","大数据职位十一"]
[45150026,"来宾市各县公安局","大数据职位十二"]
[45150027,"梧州市藤县公安局","大数据职位十三"]
[45150028,"北海市合浦县公安局","大数据职位十四"]
[45150029,"贵港市桂平市公安局","大数据职位十五"]
[45150030,"市级公安机关","网络安全职位一"]
[45150031,"市、县级公安机关","网络安全职位二"]
[45150032,"南宁市各县公安局","网络安全职位三"]
[45150033,"桂林市各县公安局","网络安全职位四"]
[45150034,"钦州市各县公安局","网络安全职位五"]
[45150035,"玉林市各县公安局","网络安全职位六"]
[45150036,"百色市各县公安局","网络安全职位七"]
[45150037,"河池市各县公安局","网络安全职位八"]
[45150038,"北海市合浦县公安局","网络安全职位九"]
[45150039,"贵港市桂平市公安局","网络安全职位十"]
[45150040,"来宾市合山市公安局","网络安全职位十一"]
[45150041,"贺州市昭平县公安局","网络安全职位十二"]
[45150042,"市、县级公安机关","法医职位一"]
[45150043,"桂林市各县公安局","法医职位二"]
[45150044,"防城港市各县公安局","法医职位三"]
[45150045,"玉林市各县公安局","法医职位四"]
[45150046,"百色市各县公安局","法医职位五"]
[45150047,"来宾市各县公安局","法医职位六"]
[45150048,"钦州市浦北县公安局","法医职位七"]
[45150049,"崇左市扶绥县公安局","法医职位八"]
[45150050,"河池市各县公安局","法医职位九"]
[45150051,"北海市合浦县公安局","法医职位十"]
[45150052,"崇左市龙州县公安局","法医职位十一"]
[45150053,"崇左市各县公安局","法医职位十二"]
[45150054,"梧州市苍梧县公安局","法医职位十三"]
[45150055,"百色市西林县公安局","法医职位十四"]
[45150056,"贺州市各县公安局","法医职位十五"]
[45150057,"河池市各县公安局","法医职位十六"]
[45150058,"市级公安机关","外语及少数民族语言翻译职位一"]
[45150059,"防城港市公安局","外语及少数民族语言翻译职位二"]
[45150060,"市级公安机关","外语及少数民族语言翻译职位三"]
[45150061,"县级公安机关","外语及少数民族语言翻译职位四"]
[45150062,"县级公安机关","外语及少数民族语言翻译职位五"]
[45150063,"市级公安机关","公安法制职位一"]
[45150064,"市、县级公安机关","公安法制职位二"]
[45150065,"市、县级公安机关","公安法制职位三"]
[45150066,"市级公安机关","公安法制职位四"]
[45150067,"市、县级公安机关","公安法制职位五"]
[45150068,"百色市各县公安局","公安法制职位六"]
[45150069,"河池市各县公安局","公安法制职位七"]
[45150070,"柳州市三江侗族自治县公安局","公安法制职位八"]
[45150071,"贺州市钟山县公安局","公安法制职位九"]
[45150072,"钦州市各县公安局","公安法制职位十"]
[45150073,"南宁市各县公安局","公安法制职位十一"]
[45150074,"桂林市各县公安局","公安法制职位十二"]
[45150075,"贵港市各县公安局","公安法制职位十三"]
[45150076,"玉林市各县公安局","公安法制职位十四"]
[45150077,"贺州市各县公安局","公安法制职位十五"]
[45150078,"北海市合浦县公安局","公安法制职位十六"]
[45150079,"防城港市东兴市公安局","公安法制职位十七"]
[45150080,"来宾市各县公安局","公安法制职位十八"]
[45150081,"桂林市各县公安局","公安法制职位十九"]
[45150082,"百色市各县公安局","公安法制职位二十"]
[45150083,"河池市各县公安局","公安法制职位二十一"]
[45150084,"梧州市藤县公安局","公安法制职位二十二"]
[45150085,"自治区财政厅","财政管理职位一"]
[45150086,"自治区财政厅","财政管理职位二"]
[45150087,"自治区自然资源厅","矿产资源管理职位"]
[45150088,"自治区自然资源厅","土地资源管理职位"]
[45150089,"自治区民政厅","综合管理职位一"]
[45150090,"自治区民政厅","综合管理职位二"]
[45150091,"自治区民政厅","综合管理职位三"]
[45150092,"自治区审计厅","审计业务职位一"]
[45150093,"自治区审计厅","审计业务职位二"]
[45150094,"自治区审计厅","综合大数据审计职位"]
[45150095,"自治区卫生健康委","医疗管理与应急处置职位一"]
[45150096,"自治区卫生健康委","医疗管理与应急处置职位二"]
[45150097,"自治区中医药局","中医机构管理职位"]
[45150098,"自治区疾控局","疾病预防控制职位"]
[45150099,"自治区社保中心","社会保险经办职位一"]
[45150100,"自治区社保中心","社会保险经办职位二"]
[45150101,"自治区社保中心","社会保险经办职位三"]
[45150102,"自治区就业服务中心（自治区人力资源市场）","办公室综合职位"]
[45150103,"自治区就业服务中心（自治区人力资源市场）","财会职位"]
[45150104,"自治区建设工程造价站","建设工程造价管理职位"]
[45150105,"自治区党委党校","基建管理职位"]
[45150106,"自治区地方志办","编辑职位一"]
[45150107,"自治区地方志办","编辑职位二"]
[45150108,"自治区供销社","项目管理职位"]
[45150109,"自治区社科联","综合职位"]
[45150110,"自治区统计局普查中心","综合统计职位一"]
[45150111,"自治区统计局普查中心","综合统计职位二"]
[45150112,"自治区人工影响天气办公室","业务技术职位"]
[45150113,"自治区药品不良反应监测中心","药品不良反应监测职位一"]
[45150114,"自治区药品不良反应监测中心","药品不良反应监测职位二"]
[45150115,"桂林市、北海市、钦州市、玉林市、河池市无线电监测中心","技术与应用职位"]
[45150116,"防城港市无线电监测中心","技术与应用职位"]
[45150117,"崇左市无线电监测中心","技术与应用职位"]
[45150118,"自治区农村经济经营管理站","农经管理职位"]
[45150119,"自治区种子管理站","行业管理职位"]
{"$rows_left_out":4070}