{"text_format":"3","workbook":"xlsx","n_sheets":4,"sheets":["原表","Sheet1","匹配代码","单位匹配"],"not_rendered":{"defined_names":2},"read":"whole","date_system":"1900"}

{"sheet":"原表","index":0,"n_rows":478,"n_cols":13,"rows_kept":478,"merged":[[0,0,0,12]]}
["2025年度贺州市事业单位公开招聘工作人员拟聘用人员名单（第一批）"]
["序号","报考部门","报考职位","准考证号码","招聘人数","姓名","性别","学历","学位","毕业院校全称","专业","体检考察情况","备注"]
[1,"贺州市交通运输综合行政执法支队","工作人员一","1145240300117",1,"罗中希","男","本科","工学学士","沈阳建筑大学","土木工程","合格"]
[2,"贺州市交通运输综合行政执法支队","工作人员二","1145240300223",1,"刘丹萍","女","本科","工学学士","广西财经学院","工程造价","合格"]
[3,"贺州市交通运输综合行政执法支队","工作人员三","1145240300304",1,"黎业华","男","本科","法学学士","广西大学","法学","合格"]
[4,"贺州市交通运输综合行政执法支队","工作人员四","1145240300322",1,"廖婷婷","女","本科","法学学士","聊城大学","法学","合格"]
[5,"贺州市交通运输综合行政执法支队","工作人员五","1145240300328",1,"薛剑锋","男","研究生","工程管理硕士","山西大学","工业工程与管理","合格"]
[6,"贺州市交通运输综合行政执法支队","工作人员六","1145240300330",1,"赖云端","女","研究生","管理学硕士","华东政法大学","教育经济与管理","合格"]
[7,"贺州市交通运输综合行政执法支队","工作人员八","1145240300403",1,"彭嫣","女","研究生","交通运输硕士","同济大学","交通运输","合格"]
[8,"贺州市交通运输综合行政执法支队","工作人员九","1145240300405",1,"李裕光","男","研究生","土木水利硕士","中国海洋大学","土木水利（海洋工程方向）","合格"]
[9,"贺州高新技术产业开发区综合服务中心","工作人员一","1145240301315",2,"罗亚等","女","本科","经济学学士","广西师范学院","国际经济与贸易","合格"]
[10,"贺州高新技术产业开发区综合服务中心","工作人员一","1145240301326",2,"刘颖","女","本科","经济学学士","湖南文理学院芙蓉学院","国际经济与贸易","合格"]
[11,"贺州高新技术产业开发区综合服务中心","工作人员二","2145240400212",1,"罗光华","男","本科","管理学学士","桂林理工大学","工程造价管理","合格"]
[12,"贺州市国营林场管理站","工作人员二","3145240600102",1,"刘孔梅","女","大学","工学学士","广西大学","木材科学与工程","合格"]
[13,"贺州市林业科学研究所","工作人员一","3145240600115",1,"黄成功","男","大学","农学学士","中南林业科技大学","林学","合格"]
[14,"贺州市林业科学研究所","工作人员二","3145240600128",1,"邝  姗","女","大学","农学学士","上海应用技术大学","园林","合格"]
[15,"贺州市姑婆山林场","工作人员","1145240300611",1,"邱雅茜","女","大学","文学学士","广西财经学院","秘书学","合格"]
[16,"贺州市福利彩票发行中心","财务管理","1145240300624",1,"邱丽妃","女","大学","管理学学士","桂林航天工业学院","财务管理","合格"]
[17,"贺州市黄姚古镇旅游文化产业发展中心","工作人员","2145240400422",1,"莫珊珊","女","大学本科","管理学学士","广西大学行健文理学院","审计学","合格"]
[18,"贺州市卫生健康综合服务中心","专业技术人员","5245240502116",1,"陆茵茵","女","本科","医学学士","广西医科大学","临床医学专业","合格"]
[19,"广西壮族自治区桂东人民医院","内分泌科    医师","5245240502120",1,"谭识洁","女","研究生","临床医学硕士","济宁医学院","内科学","合格"]
[20,"广西壮族自治区桂东人民医院","康复医学科  医师一","5145240502401",1,"梁永健","男","研究生","中医硕士","广西中医药大学","中医骨伤科学","合格"]
[21,"贺州市妇幼保健院","麻醉科医师","5245240502122",1,"周慧娟","女","本科","医学学士","广西医科大学","临床医学专业","合格"]
[22,"贺州市疾病预防控制中心","工作人员一","1145240301611",1,"钟钰皎","女","本科","管理学学士","广西中医药大学","公共事业管理","合格"]
[23,"贺州市疾病预防控制中心","工作人员二","5545240500814",1,"覃常聚","男","本科","理学学士","桂林医学院","医学检验技术","合格"]
[24,"贺州市皮肤病防治院（贺州市第五人民医院）","公共卫生执业医师","5645240500101",1,"岑祚洁","女","研究生","医学硕士","广西医科大学","流行病与卫生统计学","合格"]
[25,"贺州市图书馆","工作人员","2145240400111",1,"邓媛元","女","研究生","艺术硕士","昆明理工大学","艺术设计","合格"]
[26,"广西东融先行示范区（贺州）综合服务中心","工作人员","1145240301604",1,"范桂冰","女","大学","法学学士","齐鲁工业大学","法学","合格"]
[27,"贺州市农技科教站","工作人员","1145240301004",1,"江丽梦","女","大学","农学学士","贺州学院","茶学","合格"]
[28,"贺州市土壤肥料生态站","工作人员","1145240301014",1,"罗婷婷","女","大学","理学学士","闽江学院地理与     海洋学院","人文地理与城乡规划","合格"]
[29,"贺州市农业科学院","工作人员","3145240600406",1,"杨姗姗","女","大学","农学学士","华南农业大学","茶学","合格"]
[30,"贺州市地震监测服务中心","工作人员一","1145240300805",1,"黄旺团","男","大学","工学学士","浙江农林大学","风景园林","合格"]
[31,"贺州市地震监测服务中心","工作人员二","1145240300818",1,"岑萃","女","大学","理学学士","中国矿业大学","地球物理学","合格"]
[32,"贺州市融媒体中心","记者","2145240400216",1,"李艳","女","本科","理学学士","郑州师范学院","物理学","合格"]
[33,"贺州市融媒体中心","视觉设计师","2145240400317",1,"赵永辉","男","本科","艺术学学士","浙江传媒学院","动画","合格"]
[34,"贺州市公共资源交易中心","工作人员","1145240301020",1,"钟婕","女","大学","经济学学士","云南大学","保险学","合格"]
[35,"贺州市财政局社会保障资金管理中心","社会保障资金管理核算职位一","1145240300418",1,"莫国伟","男","大学本科","管理学学士","桂林航天工业学院","财务管理","合格"]
[36,"贺州市财政局社会保障资金管理中心","社会保障资金管理核算职位二","1145240300421",1,"罗媛珊","女","大学本科","经济学学士","东北师范大学经济与管理学院","财政学","合格"]
[37,"贺州市水旱灾害防御中心","专业技术岗位","3145240600202",1,"黎博予","男","大学本科","工学学士","华南农业大学","水利水电工程","合格"]
[38,"贺州市科学技术馆","专业技术岗位","2145240400206",1,"罗贞昶","男","本科","文学学士","上海理工大学","传播学","合格"]
[39,"贺州第一高级中学","图书管理员","2145240400425",1,"黄苗","女","本科","管理学学士","黑龙江大学","档案学","合格"]
[40,"贺州第一高级中学","工作人员","3145240600424",1,"杨惠","女","本科","工学学士","玉林师范学院","计算机科学与技术","合格"]
[41,"贺州第二高级中学","校医","5245240502101",1,"黄雅萍","女","本科","医学学士","湖北民族学院科技学院","临床医学","合格"]
[42,"贺州第三高级中学","校医","452402199010010000",1,"柳敏","女","本科","医学学士","桂林医学院","临床医学","合格"]
[43,"贺州第三高级中学","图书管理员","452402200008154000",1,"薛红艇","男","本科","管理学学士","湘潭大学","档案学","合格"]
[44,"贺州第三高级中学","工作人员","452427199312040000",1,"唐微","女","本科","文学学士","国家开放大学","汉语言文学（师范方向）","合格"]
[45,"贺州第三高级中学","财务人员一","452402199710110000",1,"黄彩兵","女","本科","管理学学士","广西财经学院 ","会计学","合格"]
[46,"贺州第三高级中学","财务人员二","452402199011104000",1,"黄晓","女","本科","管理学学士","广西财经学院 ","财务管理","合格"]
[47,"贺州市幼儿园","财务人员","2145240401211",1,"周娟","女","本科","管理学学士","广西大学","会计学","合格"]
[48,"贺州市职业教育发展中心","工作人员一","3145240600720",1,"麦天民","男","本科","工学学士","长安大学","汽车服务工程","合格"]
[49,"贺州市职业教育发展中心","工作人员三","2145240401130",1,"陈剑柱","男","本科","管理学学士","广西科技大学","工商管理","合格"]
[50,"贺州市职业教育发展中心","工作人员四","5545240500601",1,"袁艳华","女","本科","理学学士","南京医科大学","康复治疗学","合格"]
[51,"八步区食品药品安全信息与监控中心","工作人员","1145240302810",1,"陶翠然","女","大学","工学学士","广东药科大学","食品质量与安全","合格"]
[52,"贺州市八步区新型墙体材料推广中心","专业技术人员","2145240403513",1,"卓俊名","男","大学\n本科","管理学学士","上海电机学院","工业工程","合格"]
[53,"八步区畜牧站","工作人员","3145240602322",1,"黄梦晓","女","本科","文学学士","广西大学","汉语言文学","合格"]
[54,"八步区农产品质量安全检测站","工作人员","3145240602214",1,"罗梓芳","女","本科","农学学士","云南农业大学","农学","合格"]
[55,"八步区农业技术推广服务站","工作人员","3145240602221",1,"温则有","男","本科","农学学士","百色学院农业与食品工程学院","设施农业科学与工程","合格"]
[56,"贺州市八步区八步街道社会事务治理中心","工作人员","2145240404615",1,"毛俊人","女","大学\n本科","管理学学士","浙江师范大学","行政管理","合格"]
[57,"贺州市八步区社会工作服务中心","工作人员","1145240302616",1,"于传鹏","男","本科","工学学士","合肥工业大学","通信工程","合格"]
[58,"贺州市八步区步头镇综合行政执法队","工作人员","1145240303730",1,"唐建琴","女","大专",null,"南宁地区教育学院","行政管理","合格"]
{"$rows_left_out":419}
{"sheet":"Sheet1","index":1,"n_rows":478,"n_cols":15,"rows_kept":478}
["2025年度贺州市事业单位公开招聘工作人员拟聘用人员名单（第一批）"]
["主管单位","报考部门","报考职位",null,"岗位代码","准考证号码","招聘人数","姓名","性别","学历","学位","毕业院校全称","专业","体检考察情况","备注"]
[{"$f":"VLOOKUP(E3,单位匹配!A:D,2,0)","v":"贺州市交通运输局"},"贺州市交通运输综合行政执法支队","工作人员一",{"$f":"B3&C3","v":"贺州市交通运输综合行政执法支队工作人员一"},{"$f":"VLOOKUP(D3,匹配代码!A:B,2,0)","v":"1452400001"},"1145240300117",1,"罗中希","男","本科","工学学士","沈阳建筑大学","土木工程","合格"]
[{"$f":"VLOOKUP(E4,单位匹配!A:D,2,0)","v":"贺州市交通运输局"},"贺州市交通运输综合行政执法支队","工作人员二",{"$f":"B4&C4","v":"贺州市交通运输综合行政执法支队工作人员二"},{"$f":"VLOOKUP(D4,匹配代码!A:B,2,0)","v":"1452400002"},"1145240300223",1,"刘丹萍","女","本科","工学学士","广西财经学院","工程造价","合格"]
[{"$f":"VLOOKUP(E5,单位匹配!A:D,2,0)","v":"贺州市交通运输局"},"贺州市交通运输综合行政执法支队","工作人员三","贺州市交通运输综合行政执法支队工作人员三",{"$f":"VLOOKUP(D5,匹配代码!A:B,2,0)","v":"1452400003"},"1145240300304",1,"黎业华","男","本科","法学学士","广西大学","法学","合格"]
[{"$f":"VLOOKUP(E6,单位匹配!A:D,2,0)","v":"贺州市交通运输局"},"贺州市交通运输综合行政执法支队","工作人员四","贺州市交通运输综合行政执法支队工作人员四",{"$f":"VLOOKUP(D6,匹配代码!A:B,2,0)","v":"1452400004"},"1145240300322",1,"廖婷婷","女","本科","法学学士","聊城大学","法学","合格"]
[{"$f":"VLOOKUP(E7,单位匹配!A:D,2,0)","v":"贺州市交通运输局"},"贺州市交通运输综合行政执法支队","工作人员五","贺州市交通运输综合行政执法支队工作人员五",{"$f":"VLOOKUP(D7,匹配代码!A:B,2,0)","v":"1452400005"},"1145240300328",1,"薛剑锋","男","研究生","工程管理硕士","山西大学","工业工程与管理","合格"]
[{"$f":"VLOOKUP(E8,单位匹配!A:D,2,0)","v":"贺州市交通运输局"},"贺州市交通运输综合行政执法支队","工作人员六","贺州市交通运输综合行政执法支队工作人员六",{"$f":"VLOOKUP(D8,匹配代码!A:B,2,0)","v":"1452400006"},"1145240300330",1,"赖云端","女","研究生","管理学硕士","华东政法大学","教育经济与管理","合格"]
[{"$f":"VLOOKUP(E9,单位匹配!A:D,2,0)","v":"贺州市交通运输局"},"贺州市交通运输综合行政执法支队","工作人员八","贺州市交通运输综合行政执法支队工作人员八",{"$f":"VLOOKUP(D9,匹配代码!A:B,2,0)","v":"1452400008"},"1145240300403",1,"彭嫣","女","研究生","交通运输硕士","同济大学","交通运输","合格"]
[{"$f":"VLOOKUP(E10,单位匹配!A:D,2,0)","v":"贺州市交通运输局"},"贺州市交通运输综合行政执法支队","工作人员九","贺州市交通运输综合行政执法支队工作人员九",{"$f":"VLOOKUP(D10,匹配代码!A:B,2,0)","v":"1452400009"},"1145240300405",1,"李裕光","男","研究生","土木水利硕士","中国海洋大学","土木水利（海洋工程方向）","合格"]
[{"$f":"VLOOKUP(E11,单位匹配!A:D,2,0)","v":"贺州高新技术产业开发区管理委员会"},"贺州高新技术产业开发区综合服务中心","工作人员一","贺州高新技术产业开发区综合服务中心工作人员一",{"$f":"VLOOKUP(D11,匹配代码!A:B,2,0)","v":"1452400032"},"1145240301315",2,"罗亚等","女","本科","经济学学士","广西师范学院","国际经济与贸易","合格"]
[{"$f":"VLOOKUP(E12,单位匹配!A:D,2,0)","v":"贺州高新技术产业开发区管理委员会"},"贺州高新技术产业开发区综合服务中心","工作人员一","贺州高新技术产业开发区综合服务中心工作人员一",{"$f":"VLOOKUP(D12,匹配代码!A:B,2,0)","v":"1452400032"},"1145240301326",2,"刘颖","女","本科","经济学学士","湖南文理学院芙蓉学院","国际经济与贸易","合格"]
[{"$f":"VLOOKUP(E13,单位匹配!A:D,2,0)","v":"贺州高新技术产业开发区管理委员会"},"贺州高新技术产业开发区综合服务中心","工作人员二","贺州高新技术产业开发区综合服务中心工作人员二",{"$f":"VLOOKUP(D13,匹配代码!A:B,2,0)","v":"1452400033"},"2145240400212",1,"罗光华","男","本科","管理学学士","桂林理工大学","工程造价管理","合格"]
[{"$f":"VLOOKUP(E14,单位匹配!A:D,2,0)","v":"贺州市林业局"},"贺州市国营林场管理站","工作人员二","贺州市国营林场管理站工作人员二",{"$f":"VLOOKUP(D14,匹配代码!A:B,2,0)","v":"1452400014"},"3145240600102",1,"刘孔梅","女","大学","工学学士","广西大学","木材科学与工程","合格"]
[{"$f":"VLOOKUP(E15,单位匹配!A:D,2,0)","v":"贺州市林业局"},"贺州市林业科学研究所","工作人员一","贺州市林业科学研究所工作人员一",{"$f":"VLOOKUP(D15,匹配代码!A:B,2,0)","v":"1452400016"},"3145240600115",1,"黄成功","男","大学","农学学士","中南林业科技大学","林学","合格"]
[{"$f":"VLOOKUP(E16,单位匹配!A:D,2,0)","v":"贺州市林业局"},"贺州市林业科学研究所","工作人员二","贺州市林业科学研究所工作人员二",{"$f":"VLOOKUP(D16,匹配代码!A:B,2,0)","v":"1452400017"},"3145240600128",1,"邝  姗","女","大学","农学学士","上海应用技术大学","园林","合格"]
[{"$f":"VLOOKUP(E17,单位匹配!A:D,2,0)","v":"贺州市林业局"},"贺州市姑婆山林场","工作人员","贺州市姑婆山林场工作人员",{"$f":"VLOOKUP(D17,匹配代码!A:B,2,0)","v":"1452400015"},"1145240300611",1,"邱雅茜","女","大学","文学学士","广西财经学院","秘书学","合格"]
[{"$f":"VLOOKUP(E18,单位匹配!A:D,2,0)","v":"贺州市民政局"},"贺州市福利彩票发行中心","财务管理","贺州市福利彩票发行中心财务管理",{"$f":"VLOOKUP(D18,匹配代码!A:B,2,0)","v":"1452400019"},"1145240300624",1,"邱丽妃","女","大学","管理学学士","桂林航天工业学院","财务管理","合格"]
[{"$f":"VLOOKUP(E19,单位匹配!A:D,2,0)","v":"贺州市人民政府"},"贺州市黄姚古镇旅游文化产业发展中心","工作人员","贺州市黄姚古镇旅游文化产业发展中心工作人员",{"$f":"VLOOKUP(D19,匹配代码!A:B,2,0)","v":"1452400037"},"2145240400422",1,"莫珊珊","女","大学本科","管理学学士","广西大学行健文理学院","审计学","合格"]
[{"$f":"VLOOKUP(E20,单位匹配!A:D,2,0)","v":"贺州市卫生健康委员会"},"贺州市卫生健康综合服务中心","专业技术人员","贺州市卫生健康综合服务中心专业技术人员",{"$f":"VLOOKUP(D20,匹配代码!A:B,2,0)","v":"1452400051"},"5245240502116",1,"陆茵茵","女","本科","医学学士","广西医科大学","临床医学专业","合格"]
[{"$f":"VLOOKUP(E21,单位匹配!A:D,2,0)","v":"贺州市卫生健康委员会"},"广西壮族自治区桂东人民医院","内分泌科医师","广西壮族自治区桂东人民医院内分泌科医师",{"$f":"VLOOKUP(D21,匹配代码!A:B,2,0)","v":"1452400057"},"5245240502120",1,"谭识洁","女","研究生","临床医学硕士","济宁医学院","内科学","合格"]
[{"$f":"VLOOKUP(E22,单位匹配!A:D,2,0)","v":"贺州市卫生健康委员会"},"广西壮族自治区桂东人民医院","康复医学科医师一","广西壮族自治区桂东人民医院康复医学科医师一",{"$f":"VLOOKUP(D22,匹配代码!A:B,2,0)","v":"1452400064"},"5145240502401",1,"梁永健","男","研究生","中医硕士","广西中医药大学","中医骨伤科学","合格"]
[{"$f":"VLOOKUP(E23,单位匹配!A:D,2,0)","v":"贺州市卫生健康委员会"},"贺州市妇幼保健院","麻醉科医师","贺州市妇幼保健院麻醉科医师",{"$f":"VLOOKUP(D23,匹配代码!A:B,2,0)","v":"1452400070"},"5245240502122",1,"周慧娟","女","本科","医学学士","广西医科大学","临床医学专业","合格"]
[{"$f":"VLOOKUP(E24,单位匹配!A:D,2,0)","v":"贺州市卫生健康委员会"},"贺州市疾病预防控制中心","工作人员一","贺州市疾病预防控制中心工作人员一",{"$f":"VLOOKUP(D24,匹配代码!A:B,2,0)","v":"1452400072"},"1145240301611",1,"钟钰皎","女","本科","管理学学士","广西中医药大学","公共事业管理","合格"]
[{"$f":"VLOOKUP(E25,单位匹配!A:D,2,0)","v":"贺州市卫生健康委员会"},"贺州市疾病预防控制中心","工作人员二","贺州市疾病预防控制中心工作人员二",{"$f":"VLOOKUP(D25,匹配代码!A:B,2,0)","v":"1452400073"},"5545240500814",1,"覃常聚","男","本科","理学学士","桂林医学院","医学检验技术","合格"]
[{"$f":"VLOOKUP(E26,单位匹配!A:D,2,0)","v":"贺州市卫生健康委员会"},"贺州市皮肤病防治院（贺州市第五人民医院）","公共卫生执业医师","贺州市皮肤病防治院（贺州市第五人民医院）公共卫生执业医师",{"$f":"VLOOKUP(D26,匹配代码!A:B,2,0)","v":"1452400071"},"5645240500101",1,"岑祚洁","女","研究生","医学硕士","广西医科大学","流行病与卫生统计学","合格"]
[{"$f":"VLOOKUP(E27,单位匹配!A:D,2,0)","v":"贺州市文化广电和旅游局"},"贺州市图书馆","工作人员","贺州市图书馆工作人员",{"$f":"VLOOKUP(D27,匹配代码!A:B,2,0)","v":"1452400020"},"2145240400111",1,"邓媛元","女","研究生","艺术硕士","昆明理工大学","艺术设计","合格"]
[{"$f":"VLOOKUP(E28,单位匹配!A:D,2,0)","v":"广西东融先行示范区（贺州）管理委员会"},"广西东融先行示范区（贺州）综合服务中心","工作人员","广西东融先行示范区（贺州）综合服务中心工作人员",{"$f":"VLOOKUP(D28,匹配代码!A:B,2,0)","v":"1452400034"},"1145240301604",1,"范桂冰","女","大学","法学学士","齐鲁工业大学","法学","合格"]
[{"$f":"VLOOKUP(E29,单位匹配!A:D,2,0)","v":"贺州市农业农村局"},"贺州市农技科教站","工作人员","贺州市农技科教站工作人员",{"$f":"VLOOKUP(D29,匹配代码!A:B,2,0)","v":"1452400027"},"1145240301004",1,"江丽梦","女","大学","农学学士","贺州学院","茶学","合格"]
[{"$f":"VLOOKUP(E30,单位匹配!A:D,2,0)","v":"贺州市农业农村局"},"贺州市土壤肥料生态站","工作人员","贺州市土壤肥料生态站工作人员",{"$f":"VLOOKUP(D30,匹配代码!A:B,2,0)","v":"1452400028"},"1145240301014",1,"罗婷婷","女","大学","理学学士","闽江学院地理与     海洋学院","人文地理与城乡规划","合格"]
[{"$f":"VLOOKUP(E31,单位匹配!A:D,2,0)","v":"贺州市农业农村局"},"贺州市农业科学院","工作人员","贺州市农业科学院工作人员",{"$f":"VLOOKUP(D31,匹配代码!A:B,2,0)","v":"1452400029"},"3145240600406",1,"杨姗姗","女","大学","农学学士","华南农业大学","茶学","合格"]
[{"$f":"VLOOKUP(E32,单位匹配!A:D,2,0)","v":"贺州市应急管理局"},"贺州市地震监测服务中心","工作人员一","贺州市地震监测服务中心工作人员一",{"$f":"VLOOKUP(D32,匹配代码!A:B,2,0)","v":"1452400021"},"1145240300805",1,"黄旺团","男","大学","工学学士","浙江农林大学","风景园林","合格"]
[{"$f":"VLOOKUP(E33,单位匹配!A:D,2,0)","v":"贺州市应急管理局"},"贺州市地震监测服务中心","工作人员二","贺州市地震监测服务中心工作人员二",{"$f":"VLOOKUP(D33,匹配代码!A:B,2,0)","v":"1452400022"},"1145240300818",1,"岑萃","女","大学","理学学士","中国矿业大学","地球物理学","合格"]
[{"$f":"VLOOKUP(E34,单位匹配!A:D,2,0)","v":"贺州市融媒体中心"},"贺州市融媒体中心","记者","贺州市融媒体中心记者",{"$f":"VLOOKUP(D34,匹配代码!A:B,2,0)","v":"1452400035"},"2145240400216",1,"李艳","女","本科","理学学士","郑州师范学院","物理学","合格"]
[{"$f":"VLOOKUP(E35,单位匹配!A:D,2,0)","v":"贺州市融媒体中心"},"贺州市融媒体中心","视觉设计师","贺州市融媒体中心视觉设计师",{"$f":"VLOOKUP(D35,匹配代码!A:B,2,0)","v":"1452400036"},"2145240400317",1,"赵永辉","男","本科","艺术学学士","浙江传媒学院","动画","合格"]
[{"$f":"VLOOKUP(E36,单位匹配!A:D,2,0)","v":"贺州市行政审批局"},"贺州市公共资源交易中心","工作人员","贺州市公共资源交易中心工作人员",{"$f":"VLOOKUP(D36,匹配代码!A:B,2,0)","v":"1452400030"},"1145240301020",1,"钟婕","女","大学","经济学学士","云南大学","保险学","合格"]
[{"$f":"VLOOKUP(E37,单位匹配!A:D,2,0)","v":"贺州市财政局"},"贺州市财政局社会保障资金管理中心","社会保障资金管理核算职位一","贺州市财政局社会保障资金管理中心社会保障资金管理核算职位一",{"$f":"VLOOKUP(D37,匹配代码!A:B,2,0)","v":"1452400011"},"1145240300418",1,"莫国伟","男","大学本科","管理学学士","桂林航天工业学院","财务管理","合格"]
[{"$f":"VLOOKUP(E38,单位匹配!A:D,2,0)","v":"贺州市财政局"},"贺州市财政局社会保障资金管理中心","社会保障资金管理核算职位二","贺州市财政局社会保障资金管理中心社会保障资金管理核算职位二",{"$f":"VLOOKUP(D38,匹配代码!A:B,2,0)","v":"1452400012"},"1145240300421",1,"罗媛珊","女","大学本科","经济学学士","东北师范大学经济与管理学院","财政学","合格"]
[{"$f":"VLOOKUP(E39,单位匹配!A:D,2,0)","v":"贺州市水利局"},"贺州市水旱灾害防御中心","专业技术岗位","贺州市水旱灾害防御中心专业技术岗位",{"$f":"VLOOKUP(D39,匹配代码!A:B,2,0)","v":"1452400018"},"3145240600202",1,"黎博予","男","大学本科","工学学士","华南农业大学","水利水电工程","合格"]
[{"$f":"VLOOKUP(E40,单位匹配!A:D,2,0)","v":"贺州市科学技术协会"},"贺州市科学技术馆","专业技术岗位","贺州市科学技术馆专业技术岗位",{"$f":"VLOOKUP(D40,匹配代码!A:B,2,0)","v":"1452400031"},"2145240400206",1,"罗贞昶","男","本科","文学学士","上海理工大学","传播学","合格"]
[{"$f":"VLOOKUP(E41,单位匹配!A:D,2,0)","v":"贺州市教育局"},"贺州第一高级中学","图书管理员","贺州第一高级中学图书管理员",{"$f":"VLOOKUP(D41,匹配代码!A:B,2,0)","v":"1452400038"},"2145240400425",1,"黄苗","女","本科","管理学学士","黑龙江大学","档案学","合格"]
[{"$f":"VLOOKUP(E42,单位匹配!A:D,2,0)","v":"贺州市教育局"},"贺州第一高级中学","工作人员","贺州第一高级中学工作人员",{"$f":"VLOOKUP(D42,匹配代码!A:B,2,0)","v":"1452400039"},"3145240600424",1,"杨惠","女","本科","工学学士","玉林师范学院","计算机科学与技术","合格"]
[{"$f":"VLOOKUP(E43,单位匹配!A:D,2,0)","v":"贺州市教育局"},"贺州第二高级中学","校医","贺州第二高级中学校医",{"$f":"VLOOKUP(D43,匹配代码!A:B,2,0)","v":"1452400040"},"5245240502101",1,"黄雅萍","女","本科","医学学士","湖北民族学院科技学院","临床医学","合格"]
[{"$f":"VLOOKUP(E44,单位匹配!A:D,2,0)","v":"贺州市教育局"},"贺州第三高级中学","校医","贺州第三高级中学校医",{"$f":"VLOOKUP(D44,匹配代码!A:B,2,0)","v":"1452400041"},"452402199010010000",1,"柳敏","女","本科","医学学士","桂林医学院","临床医学","合格"]
[{"$f":"VLOOKUP(E45,单位匹配!A:D,2,0)","v":"贺州市教育局"},"贺州第三高级中学","图书管理员","贺州第三高级中学图书管理员",{"$f":"VLOOKUP(D45,匹配代码!A:B,2,0)","v":"1452400042"},"452402200008154000",1,"薛红艇","男","本科","管理学学士","湘潭大学","档案学","合格"]
[{"$f":"VLOOKUP(E46,单位匹配!A:D,2,0)","v":"贺州市教育局"},"贺州第三高级中学","工作人员","贺州第三高级中学工作人员",{"$f":"VLOOKUP(D46,匹配代码!A:B,2,0)","v":"1452400043"},"452427199312040000",1,"唐微","女","本科","文学学士","国家开放大学","汉语言文学（师范方向）","合格"]
[{"$f":"VLOOKUP(E47,单位匹配!A:D,2,0)","v":"贺州市教育局"},"贺州第三高级中学","财务人员一","贺州第三高级中学财务人员一",{"$f":"VLOOKUP(D47,匹配代码!A:B,2,0)","v":"1452400044"},"452402199710110000",1,"黄彩兵","女","本科","管理学学士","广西财经学院 ","会计学","合格"]
[{"$f":"VLOOKUP(E48,单位匹配!A:D,2,0)","v":"贺州市教育局"},"贺州第三高级中学","财务人员二","贺州第三高级中学财务人员二",{"$f":"VLOOKUP(D48,匹配代码!A:B,2,0)","v":"1452400045"},"452402199011104000",1,"黄晓","女","本科","管理学学士","广西财经学院 ","财务管理","合格"]
[{"$f":"VLOOKUP(E49,单位匹配!A:D,2,0)","v":"贺州市教育局"},"贺州市幼儿园","财务人员","贺州市幼儿园财务人员",{"$f":"VLOOKUP(D49,匹配代码!A:B,2,0)","v":"1452400050"},"2145240401211",1,"周娟","女","本科","管理学学士","广西大学","会计学","合格"]
[{"$f":"VLOOKUP(E50,单位匹配!A:D,2,0)","v":"贺州市教育局"},"贺州市职业教育发展中心","工作人员一","贺州市职业教育发展中心工作人员一",{"$f":"VLOOKUP(D50,匹配代码!A:B,2,0)","v":"1452400046"},"3145240600720",1,"麦天民","男","本科","工学学士","长安大学","汽车服务工程","合格"]
[{"$f":"VLOOKUP(E51,单位匹配!A:D,2,0)","v":"贺州市教育局"},"贺州市职业教育发展中心","工作人员三","贺州市职业教育发展中心工作人员三",{"$f":"VLOOKUP(D51,匹配代码!A:B,2,0)","v":"1452400048"},"2145240401130",1,"陈剑柱","男","本科","管理学学士","广西科技大学","工商管理","合格"]
[{"$f":"VLOOKUP(E52,单位匹配!A:D,2,0)","v":"贺州市教育局"},"贺州市职业教育发展中心","工作人员四","贺州市职业教育发展中心工作人员四",{"$f":"VLOOKUP(D52,匹配代码!A:B,2,0)","v":"1452400049"},"5545240500601",1,"袁艳华","女","本科","理学学士","南京医科大学","康复治疗学","合格"]
[{"$f":"VLOOKUP(E53,单位匹配!A:D,2,0)","v":"贺州市八步区市场监督管理局"},"八步区食品药品安全信息与监控中心","工作人员","八步区食品药品安全信息与监控中心工作人员",{"$f":"VLOOKUP(D53,匹配代码!A:B,2,0)","v":"1452400106"},"1145240302810",1,"陶翠然","女","大学","工学学士","广东药科大学","食品质量与安全","合格"]
[{"$f":"VLOOKUP(E54,单位匹配!A:D,2,0)","v":"贺州市八步区住房和城乡建设局"},"贺州市八步区新型墙体材料推广中心","专业技术人员","贺州市八步区新型墙体材料推广中心专业技术人员",{"$f":"VLOOKUP(D54,匹配代码!A:B,2,0)","v":"1452400107"},"2145240403513",1,"卓俊名","男","大学\n本科","管理学学士","上海电机学院","工业工程","合格"]
[{"$f":"VLOOKUP(E55,单位匹配!A:D,2,0)","v":"贺州市八步区农业农村局"},"贺州市八步区畜牧站","工作人员","贺州市八步区畜牧站工作人员",{"$f":"VLOOKUP(D55,匹配代码!A:B,2,0)","v":"1452400111"},"3145240602322",1,"黄梦晓","女","本科","文学学士","广西大学","汉语言文学","合格"]
[{"$f":"VLOOKUP(E56,单位匹配!A:D,2,0)","v":"贺州市八步区农业农村局"},"八步区农产品质量安全检测站","工作人员","八步区农产品质量安全检测站工作人员",{"$f":"VLOOKUP(D56,匹配代码!A:B,2,0)","v":"1452400109"},"3145240602214",1,"罗梓芳","女","本科","农学学士","云南农业大学","农学","合格"]
[{"$f":"VLOOKUP(E57,单位匹配!A:D,2,0)","v":"贺州市八步区农业农村局"},"贺州市八步区农业技术推广服务站","工作人员","贺州市八步区农业技术推广服务站工作人员",{"$f":"VLOOKUP(D57,匹配代码!A:B,2,0)","v":"1452400110"},"3145240602221",1,"温则有","男","本科","农学学士","百色学院农业与食品工程学院","设施农业科学与工程","合格"]
[{"$f":"VLOOKUP(E58,单位匹配!A:D,2,0)","v":"贺州市八步区八步街道办事处"},"贺州市八步区八步街道社会事务治理中心","工作人员","贺州市八步区八步街道社会事务治理中心工作人员",{"$f":"VLOOKUP(D58,匹配代码!A:B,2,0)","v":"1452400154"},"2145240404615",1,"毛俊人","女","大学\n本科","管理学学士","浙江师范大学","行政管理","合格"]
[{"$f":"VLOOKUP(E59,单位匹配!A:D,2,0)","v":"中共贺州市八步区委员会社会工作部"},"贺州市八步区社会工作服务中心","工作人员","贺州市八步区社会工作服务中心工作人员",{"$f":"VLOOKUP(D59,匹配代码!A:B,2,0)","v":"1452400103"},"1145240302616",1,"于传鹏","男","本科","工学学士","合肥工业大学","通信工程","合格"]
[{"$f":"VLOOKUP(E60,单位匹配!A:D,2,0)","v":"贺州市八步区步头镇人民政府"},"贺州市八步区步头镇综合行政执法队","工作人员","贺州市八步区步头镇综合行政执法队工作人员",{"$f":"VLOOKUP(D60,匹配代码!A:B,2,0)","v":"1452400129"},"1145240303730",1,"唐建琴","女","大专",null,"南宁地区教育学院","行政管理","合格"]
{"$rows_left_out":419}
{"sheet":"匹配代码","index":2,"n_rows":552,"n_cols":5,"rows_kept":552}
[null,"岗位编码","主管部门","招聘单位","招聘岗位名称"]
["贺州市交通运输综合行政执法支队工作人员一","1452400001","贺州市交通运输局","贺州市交通运输综合行政执法支队","工作人员一"]
["贺州市交通运输综合行政执法支队工作人员二","1452400002","贺州市交通运输局","贺州市交通运输综合行政执法支队","工作人员二"]
["贺州市交通运输综合行政执法支队工作人员三","1452400003","贺州市交通运输局","贺州市交通运输综合行政执法支队","工作人员三"]
["贺州市交通运输综合行政执法支队工作人员四","1452400004","贺州市交通运输局","贺州市交通运输综合行政执法支队","工作人员四"]
["贺州市交通运输综合行政执法支队工作人员五","1452400005","贺州市交通运输局","贺州市交通运输综合行政执法支队","工作人员五"]
["贺州市交通运输综合行政执法支队工作人员六","1452400006","贺州市交通运输局","贺州市交通运输综合行政执法支队","工作人员六"]
["贺州市交通运输综合行政执法支队工作人员七","1452400007","贺州市交通运输局","贺州市交通运输综合行政执法支队","工作人员七"]
["贺州市交通运输综合行政执法支队工作人员八","1452400008","贺州市交通运输局","贺州市交通运输综合行政执法支队","工作人员八"]
["贺州市交通运输综合行政执法支队工作人员九","1452400009","贺州市交通运输局","贺州市交通运输综合行政执法支队","工作人员九"]
["贺州市综合运输发展中心工作人员","1452400010","贺州市交通运输局","贺州市综合运输发展中心","工作人员"]
["贺州市财政局社会保障资金管理中心社会保障资金管理核算职位一","1452400011","贺州市财政局","贺州市财政局社会保障资金管理中心","社会保障资金管理核算职位一"]
["贺州市财政局社会保障资金管理中心社会保障资金管理核算职位二","1452400012","贺州市财政局","贺州市财政局社会保障资金管理中心","社会保障资金管理核算职位二"]
["贺州市国营林场管理站工作人员一","1452400013","贺州市林业局","贺州市国营林场管理站","工作人员一"]
["贺州市国营林场管理站工作人员二","1452400014","贺州市林业局","贺州市国营林场管理站","工作人员二"]
["贺州市姑婆山林场工作人员","1452400015","贺州市林业局","贺州市姑婆山林场","工作人员"]
["贺州市林业科学研究所工作人员一","1452400016","贺州市林业局","贺州市林业科学研究所","工作人员一"]
["贺州市林业科学研究所工作人员二","1452400017","贺州市林业局","贺州市林业科学研究所","工作人员二"]
["贺州市水旱灾害防御中心专业技术岗位","1452400018","贺州市水利局","贺州市水旱灾害防御中心","专业技术岗位"]
["贺州市福利彩票发行中心财务管理","1452400019","贺州市民政局","贺州市福利彩票发行中心","财务管理"]
["贺州市图书馆工作人员","1452400020","贺州市文化广电和旅游局","贺州市图书馆","工作人员"]
["贺州市地震监测服务中心工作人员一","1452400021","贺州市应急管理局","贺州市地震监测服务中心","工作人员一"]
["贺州市地震监测服务中心工作人员二","1452400022","贺州市应急管理局","贺州市地震监测服务中心","工作人员二"]
["贺州市土地征收服务中心工作人员","1452400023","贺州市自然资源局","贺州市土地征收服务中心","工作人员"]
["贺州市矿产站工作人员","1452400024","贺州市自然资源局","贺州市矿产站","工作人员"]
["贺州市城乡规划设计院工作人员","1452400025","贺州市自然资源局","贺州市城乡规划设计院","工作人员"]
["贺州市自然资源测绘地理信息规划院工作人员","1452400026","贺州市自然资源局","贺州市自然资源测绘地理信息规划院","工作人员"]
["贺州市农技科教站工作人员","1452400027","贺州市农业农村局","贺州市农技科教站","工作人员"]
["贺州市土壤肥料生态站工作人员","1452400028","贺州市农业农村局","贺州市土壤肥料生态站","工作人员"]
["贺州市农业科学院工作人员","1452400029","贺州市农业农村局","贺州市农业科学院","工作人员"]
["贺州市公共资源交易中心工作人员","1452400030","贺州市行政审批局","贺州市公共资源交易中心","工作人员"]
["贺州市科学技术馆专业技术岗位","1452400031","贺州市科学技术协会","贺州市科学技术馆","专业技术岗位"]
["贺州高新技术产业开发区综合服务中心工作人员一","1452400032","贺州高新技术产业开发区管理委员会","贺州高新技术产业开发区综合服务中心","工作人员一"]
["贺州高新技术产业开发区综合服务中心工作人员二","1452400033","贺州高新技术产业开发区管理委员会","贺州高新技术产业开发区综合服务中心","工作人员二"]
["广西东融先行示范区（贺州）综合服务中心工作人员","1452400034","广西东融先行示范区（贺州）管理委员会","广西东融先行示范区（贺州）综合服务中心","工作人员"]
["贺州市融媒体中心记者","1452400035","贺州市融媒体中心","贺州市融媒体中心","记者"]
["贺州市融媒体中心视觉设计师","1452400036","贺州市融媒体中心","贺州市融媒体中心","视觉设计师"]
["贺州市黄姚古镇旅游文化产业发展中心工作人员","1452400037","贺州市人民政府","贺州市黄姚古镇旅游文化产业发展中心","工作人员"]
["贺州第一高级中学图书管理员","1452400038","贺州市教育局","贺州第一高级中学","图书管理员"]
["贺州第一高级中学工作人员","1452400039","贺州市教育局","贺州第一高级中学","工作人员"]
["贺州第二高级中学校医","1452400040","贺州市教育局","贺州第二高级中学","校医"]
["贺州第三高级中学校医","1452400041","贺州市教育局","贺州第三高级中学","校医"]
["贺州第三高级中学图书管理员","1452400042","贺州市教育局","贺州第三高级中学","图书管理员"]
["贺州第三高级中学工作人员","1452400043","贺州市教育局","贺州第三高级中学","工作人员"]
["贺州第三高级中学财务人员一","1452400044","贺州市教育局","贺州第三高级中学","财务人员一"]
["贺州第三高级中学财务人员二","1452400045","贺州市教育局","贺州第三高级中学","财务人员二"]
["贺州市职业教育发展中心工作人员一","1452400046","贺州市教育局","贺州市职业教育发展中心","工作人员一"]
["贺州市职业教育发展中心工作人员二","1452400047","贺州市教育局","贺州市职业教育发展中心","工作人员二"]
["贺州市职业教育发展中心工作人员三","1452400048","贺州市教育局","贺州市职业教育发展中心","工作人员三"]
["贺州市职业教育发展中心工作人员四","1452400049","贺州市教育局","贺州市职业教育发展中心","工作人员四"]
["贺州市幼儿园财务人员","1452400050","贺州市教育局","贺州市幼儿园","财务人员"]
["贺州市卫生健康综合服务中心专业技术人员","1452400051","贺州市卫生健康委员会","贺州市卫生健康综合服务中心","专业技术人员"]
["广西壮族自治区桂东人民医院神经内科一科医师","1452400052","贺州市卫生健康委员会","广西壮族自治区桂东人民医院","神经内科一科医师"]
["广西壮族自治区桂东人民医院神经内科二科医师","1452400053","贺州市卫生健康委员会","广西壮族自治区桂东人民医院","神经内科二科医师"]
["广西壮族自治区桂东人民医院心血管内科一科医师","1452400054","贺州市卫生健康委员会","广西壮族自治区桂东人民医院","心血管内科一科医师"]
["广西壮族自治区桂东人民医院心血管内科二科医师","1452400055","贺州市卫生健康委员会","广西壮族自治区桂东人民医院","心血管内科二科医师"]
["广西壮族自治区桂东人民医院肾内科医师","1452400056","贺州市卫生健康委员会","广西壮族自治区桂东人民医院","肾内科医师"]
["广西壮族自治区桂东人民医院内分泌科医师","1452400057","贺州市卫生健康委员会","广西壮族自治区桂东人民医院","内分泌科医师"]
["广西壮族自治区桂东人民医院神经外科医师","1452400058","贺州市卫生健康委员会","广西壮族自治区桂东人民医院","神经外科医师"]
["广西壮族自治区桂东人民医院心胸外科医师","1452400059","贺州市卫生健康委员会","广西壮族自治区桂东人民医院","心胸外科医师"]
{"$rows_left_out":493}
{"sheet":"单位匹配","index":3,"n_rows":552,"n_cols":4,"rows_kept":552}
["岗位编码","主管部门","招聘单位","招聘岗位名称"]
["1452400001","贺州市交通运输局","贺州市交通运输综合行政执法支队","工作人员一"]
["1452400002","贺州市交通运输局","贺州市交通运输综合行政执法支队","工作人员二"]
["1452400003","贺州市交通运输局","贺州市交通运输综合行政执法支队","工作人员三"]
["1452400004","贺州市交通运输局","贺州市交通运输综合行政执法支队","工作人员四"]
["1452400005","贺州市交通运输局","贺州市交通运输综合行政执法支队","工作人员五"]
["1452400006","贺州市交通运输局","贺州市交通运输综合行政执法支队","工作人员六"]
["1452400007","贺州市交通运输局","贺州市交通运输综合行政执法支队","工作人员七"]
["1452400008","贺州市交通运输局","贺州市交通运输综合行政执法支队","工作人员八"]
["1452400009","贺州市交通运输局","贺州市交通运输综合行政执法支队","工作人员九"]
["1452400010","贺州市交通运输局","贺州市综合运输发展中心","工作人员"]
["1452400011","贺州市财政局","贺州市财政局社会保障资金管理中心","社会保障资金管理核算职位一"]
["1452400012","贺州市财政局","贺州市财政局社会保障资金管理中心","社会保障资金管理核算职位二"]
["1452400013","贺州市林业局","贺州市国营林场管理站","工作人员一"]
["1452400014","贺州市林业局","贺州市国营林场管理站","工作人员二"]
["1452400015","贺州市林业局","贺州市姑婆山林场","工作人员"]
["1452400016","贺州市林业局","贺州市林业科学研究所","工作人员一"]
["1452400017","贺州市林业局","贺州市林业科学研究所","工作人员二"]
["1452400018","贺州市水利局","贺州市水旱灾害防御中心","专业技术岗位"]
["1452400019","贺州市民政局","贺州市福利彩票发行中心","财务管理"]
["1452400020","贺州市文化广电和旅游局","贺州市图书馆","工作人员"]
["1452400021","贺州市应急管理局","贺州市地震监测服务中心","工作人员一"]
["1452400022","贺州市应急管理局","贺州市地震监测服务中心","工作人员二"]
["1452400023","贺州市自然资源局","贺州市土地征收服务中心","工作人员"]
["1452400024","贺州市自然资源局","贺州市矿产站","工作人员"]
["1452400025","贺州市自然资源局","贺州市城乡规划设计院","工作人员"]
["1452400026","贺州市自然资源局","贺州市自然资源测绘地理信息规划院","工作人员"]
["1452400027","贺州市农业农村局","贺州市农技科教站","工作人员"]
["1452400028","贺州市农业农村局","贺州市土壤肥料生态站","工作人员"]
["1452400029","贺州市农业农村局","贺州市农业科学院","工作人员"]
["1452400030","贺州市行政审批局","贺州市公共资源交易中心","工作人员"]
["1452400031","贺州市科学技术协会","贺州市科学技术馆","专业技术岗位"]
["1452400032","贺州高新技术产业开发区管理委员会","贺州高新技术产业开发区综合服务中心","工作人员一"]
["1452400033","贺州高新技术产业开发区管理委员会","贺州高新技术产业开发区综合服务中心","工作人员二"]
["1452400034","广西东融先行示范区（贺州）管理委员会","广西东融先行示范区（贺州）综合服务中心","工作人员"]
["1452400035","贺州市融媒体中心","贺州市融媒体中心","记者"]
["1452400036","贺州市融媒体中心","贺州市融媒体中心","视觉设计师"]
["1452400037","贺州市人民政府","贺州市黄姚古镇旅游文化产业发展中心","工作人员"]
["1452400038","贺州市教育局","贺州第一高级中学","图书管理员"]
["1452400039","贺州市教育局","贺州第一高级中学","工作人员"]
["1452400040","贺州市教育局","贺州第二高级中学","校医"]
["1452400041","贺州市教育局","贺州第三高级中学","校医"]
["1452400042","贺州市教育局","贺州第三高级中学","图书管理员"]
["1452400043","贺州市教育局","贺州第三高级中学","工作人员"]
["1452400044","贺州市教育局","贺州第三高级中学","财务人员一"]
["1452400045","贺州市教育局","贺州第三高级中学","财务人员二"]
["1452400046","贺州市教育局","贺州市职业教育发展中心","工作人员一"]
["1452400047","贺州市教育局","贺州市职业教育发展中心","工作人员二"]
["1452400048","贺州市教育局","贺州市职业教育发展中心","工作人员三"]
["1452400049","贺州市教育局","贺州市职业教育发展中心","工作人员四"]
["1452400050","贺州市教育局","贺州市幼儿园","财务人员"]
["1452400051","贺州市卫生健康委员会","贺州市卫生健康综合服务中心","专业技术人员"]
["1452400052","贺州市卫生健康委员会","广西壮族自治区桂东人民医院","神经内科一科医师"]
["1452400053","贺州市卫生健康委员会","广西壮族自治区桂东人民医院","神经内科二科医师"]
["1452400054","贺州市卫生健康委员会","广西壮族自治区桂东人民医院","心血管内科一科医师"]
["1452400055","贺州市卫生健康委员会","广西壮族自治区桂东人民医院","心血管内科二科医师"]
["1452400056","贺州市卫生健康委员会","广西壮族自治区桂东人民医院","肾内科医师"]
["1452400057","贺州市卫生健康委员会","广西壮族自治区桂东人民医院","内分泌科医师"]
["1452400058","贺州市卫生健康委员会","广西壮族自治区桂东人民医院","神经外科医师"]
["1452400059","贺州市卫生健康委员会","广西壮族自治区桂东人民医院","心胸外科医师"]
{"$rows_left_out":492}